Errors in GAIM .56 and .59!

Find out how to get that @*&^$&@ thing to compile!

Errors in GAIM .56 and .59!

Postby beav » Wed Jul 24, 2002 4:23 pm

Ok, this is what i get when i try and compile gaim:

/usr/bin/ld: -undefined error must be used when -twolevel_namespace is in effect
make[2]: *** [] Error 1
make[1]: *** [all-recursive] Error 1
make: *** [all-recursive-am] Error 2

Any ideas?
Posts: 1
Joined: Wed Jul 24, 2002 7:00 pm

Re: Errors in GAIM .56 and .59!

Postby <sali> » Thu Dec 19, 2002 4:01 am

i just had an equal problem with sablot.. try to find the line allow_undefined_flag=' -undefined suppress' in the configure file and set it to allow_undefined_flag='-flat_namespace -undefined suppress' it should be under the darwin case-/if-something

Return to Compile Problems

Who is online

Users browsing this forum: No registered users and 4 guests